Target
S-methyl-5'-thioadenosine phosphorylase
Ligand
BDBM36497
Substrate
BDBM22111
Meas. Tech.
Enzyme Activity Assay
pH
7.5±0
Temperature
298.15±0 K
Kd
0.700±0.0 nM
Citation
 Gutierrez, JALuo, MSingh, VLi, LBrown, RLNorris, GEEvans, GBFurneaux, RHTyler, PCPainter, GFLenz, DHSchramm, VL Picomolar inhibitors as transition-state probes of 5'-methylthioadenosine nucleosidases. ACS Chem Biol 2:725-34 (2007)  
Target
Name:
S-methyl-5'-thioadenosine phosphorylase
Synonyms:
5'-Methylthioadenosine phosphorylase (MTAP) MTA phosphorylase MTAP_HUMAN Methylthioadenosine Phosphorylase (MTAP) | S-methyl-5 -thioadenosine phosphorylase
Type:
Enzyme
Mol. Mass.:
31239.23
Organism:
Homo sapiens (Human)
Description:
Residue:
283
  
Inhibitor
Name:
BDBM36497
Synonyms:
CHEMBL191436 | DADMe-ImmA-Bn
Type:
Small organic molecule
Emp. Form.:
C19H23N5OS
Mol. Mass.:
369.484
SMILES:
Nc1ncnc2c(CN3CC(O)C(CSCc4ccccc4)C3)c[nH]c12
:
Substrate
Name:
BDBM22111
Synonyms:
(2R,3R,4S,5S)-2-(6-amino-9H-purin-9-yl)-5-[(methylsulfanyl)methyl]oxolane-3,4-diol 5'-Methylthioado CHEMBL277041 | MTA
Type:
Nucleoside or nucleotide
Emp. Form.:
C11H15N5O3S
Mol. Mass.:
297.334
SMILES:
CSC[C@H]1O[C@H]([C@H](O)[C@@H]1O)n1cnc2c(N)ncnc12
: