Target
Protein O-GlcNAcase
Ligand
BDBM50182804
Substrate
BDBM18365
Meas. Tech.
Enzyme Inhibition Assay
pH
4.25±0
Temperature
303.15±0 K
Ki
2.36e+4± 9.7e+2 nM
Citation
 Ho, CWPopat, SDLiu, TWTsai, KCHo, MJChen, WHYang, ASLin, CH Development of GlcNAc-inspired iminocyclitiols as potent and selective N-acetyl-beta-hexosaminidase inhibitors. ACS Chem Biol 5:489-97 (2010)  
Target
Name:
Protein O-GlcNAcase
Synonyms:
2-acetamido-2-deoxy-β-D-glucopyranosidase (O-GlcNAcase) Beta-hexosaminidase (O-GlcNAcase) HEXC MEA5 N-acetyl-beta-D-glucosaminidase (O-GlcNAcase) OGA Protein O-GlcNAcase
Type:
Enzyme
Mol. Mass.:
102874.67
Organism:
Homo sapiens (Human)
Description:
O60502
Residue:
916
  
Inhibitor
Name:
BDBM50182804
Synonyms:
2-ACETAMIDO-1,2-DIDEOXYNOJIRMYCIN Iminocyclitol, 5 N-[4,5-dihydroxy-6-(hydroxymethyl)piperidin-3-yl]acetamide, 1
Type:
Small organic molecule
Emp. Form.:
C8H16N2O4
Mol. Mass.:
204.2236
SMILES:
CC(=O)N[C@H]1CN[C@H](CO)[C@@H](O)[C@@H]1O
:
Substrate
Name:
BDBM18365
Synonyms:
4-Methylumbelliferyl alpha-D-glucopyranoside 4-methylumbelliferyl alpha-glucoside
Type:
Small organic molecule
Emp. Form.:
C16H18O8
Mol. Mass.:
338.3093
SMILES:
Cc1cc(=O)oc2cc(O[C@H]3O[C@H](CO)[C@@H](O)[C@H](O)[C@H]3O)ccc12
: