Target
Gag polyprotein
Ligand
BDBM519
Substrate
Meas. Tech.
Enzyme Inhibtion Assay
pH
6.5±0
IC50
13.1±5.2 nM
Citation
 Rodgers, JDLam, PYJohnson, BLWang, HLi, RRu, YKo, SSSeitz, SPTrainor, GLAnderson, PSKlabe, RMBacheler, LTCordova, BGarber, SReid, CWright, MRChang, CHErickson-Viitanen, S Design and selection of DMP 850 and DMP 851: the next generation of cyclic urea HIV protease inhibitors. Chem Biol 5:597-608 (1998)  
Target
Name:
Gag polyprotein
Synonyms:
GAG_HV1MN | gag
Type:
Protein
Mol. Mass.:
56781.96
Organism:
Human immunodeficiency virus type 1 group M subtype B (isolate MN) (HIV-1)
Description:
P05888
Residue:
507
  
Inhibitor
Name:
BDBM519
Synonyms:
(2S)-N-[(2S,3R)-4-[(3S,4aS,8aS)-3-(tert-butylcarbamoyl)-decahydroisoquinolin-2-yl]-3-hydroxy-1-phenylbutan-2-yl]-2-(quinolin-2-ylformamido)butanediamide Fortovase Ro 31-8959 Saquinavir
Type:
Small organic molecule
Emp. Form.:
C38H50N6O5
Mol. Mass.:
670.8408
SMILES:
CC(C)(C)NC(=O)[C@@H]1C[C@@H]2CCCC[C@@H]2CN1C[C@@H](O)[C@H](Cc1ccccc1)NC(=O)[C@H](CC(N)=O)NC(=O)c1ccc2ccccc2n1
: