Target
5'-AMP-activated protein kinase catalytic subunit alpha-1
Ligand
BDBM31094
Substrate
Meas. Tech.
Kinase Inhibitor Selectivity Profiling Assay
Kd
180±n/a nM
Citation
 PubChem, PC Kinase Inhibitor Selectivity Profiling Assay PubChem Bioassay (2008)[AID] 
Target
Name:
5'-AMP-activated protein kinase catalytic subunit alpha-1
Synonyms:
AAPK1_HUMAN AMP-activated protein kinase alpha-1/beta-2/gamma-2 AMPK subunit alpha-1 AMPK1 PRKAA1 | Tau-protein kinase PRKAA1
Type:
Protein
Mol. Mass.:
64023.62
Organism:
Homo sapiens (Human)
Description:
Q13131
Residue:
559
  
Inhibitor
Name:
BDBM31094
Synonyms:
PKC-412 | cid_24202429
Type:
Small organic molecule
Emp. Form.:
C35H30N4O4
Mol. Mass.:
570.6371
SMILES:
[H][C@@]12C[C@@H]([C@H](OC)[C@@](C)(O1)n1c3ccccc3c3c4CNC(=O)c4c4c5ccccc5n2c4c13)N(C)C(=O)c1ccccc1
: