Target
Cyclin-dependent kinase 2
Ligand
BDBM7533
Substrate
Meas. Tech.
Kinase Inhibitor Selectivity Profiling Assay
Kd
3400±n/a nM
Citation
 PubChem, PC Kinase Inhibitor Selectivity Profiling Assay PubChem Bioassay (2008)[AID] 
Target
Name:
Cyclin-dependent kinase 2
Synonyms:
CDK2 CDK2_HUMAN Cell division protein kinase 2 Protein cereblon/Cyclin-dependent kinase 2 | p33 protein kinase
Type:
Enzyme Subunit
Mol. Mass.:
33938.17
Organism:
Homo sapiens (Human)
Description:
P24941
Residue:
298
  
Inhibitor
Name:
BDBM7533
Synonyms:
(2R)-2-[[6-(benzylamino)-9-isopropyl-purin-2-yl]amino]butan-1-ol (2R)-2-[[6-[(phenylmethyl)amino]-9-propan-2-yl-2-purinyl]amino]-1-butanol (2R)-2-{[6-(benzylamino)-9-(propan-2-yl)-9H-purin-2-yl]amino}butan-1-ol 2,6,9-Trisubstituted purine deriv. 28 CYC-202 cid_160355
Type:
Small organic molecule
Emp. Form.:
C19H26N6O
Mol. Mass.:
354.4493
SMILES:
CC[C@H](CO)Nc1nc(NCc2ccccc2)c2ncn(C(C)C)c2n1
: