Target
5-hydroxytryptamine receptor 1A
Ligand
BDBM264118
Substrate
Meas. Tech.
Rat Synaptosome Binding Assay
pH
7.4±n/a
IC50
0.230±n/a nM
Comments
extracted
Citation
 Zhang, YJin, CZhou, R Substituted piperazine compounds and methods of use thereof US Patent  US9714232 Publication Date 7/25/2017 
Target
Name:
5-hydroxytryptamine receptor 1A
Synonyms:
5-HT-1A 5-HT1A 5-hydroxytryptamine receptor 1A (5HT1A) 5ht1a Htr1a Serotonin 1a (5-HT1a) receptor/Adrenergic receptor alpha-1 | Serotonin receptor 1A
Type:
G Protein-Coupled Receptor (GPCR)
Mol. Mass.:
46445.29
Organism:
Rattus norvegicus (rat)
Description:
Binding assays were performed using rat hippocampal membranes.
Residue:
422
  
Inhibitor
Name:
BDBM264118
Synonyms:
3-(4-(4-(4-(5-oxo-1,6-naphthyridin-6(5H)-yl)phenyl)piperazin-1-yl)butyl)-1H-indole-5-carbonitrile | US9714232, 31
Type:
Small organic molecule
Emp. Form.:
C31H30N6O
Mol. Mass.:
502.6095
SMILES:
O=c1n(ccc2ncccc12)-c1ccc(cc1)N1CCN(CCCCc2c[nH]c3ccc(cc23)C#N)CC1
: