Target
Sphingosine 1-phosphate receptor 1
Ligand
BDBM36864
Substrate
Meas. Tech.
Dose Response Assays for S1P1 Agonists and Agonism Potentiators - Potentiator Assay 60K MLSMR
EC50
2955±n/a nM
Citation
 PubChem, PC Dose Response Assays for S1P1 Agonists and Agonism Potentiators - Potentiator Assay 60K MLSMR PubChem Bioassay (2007)[AID] 
Target
Name:
Sphingosine 1-phosphate receptor 1
Synonyms:
CHEDG1 Endothelial differentiation G-protein coupled receptor 1 S1P1 S1PR1_HUMAN Sphingosine 1-phosphate receptor Edg-1
Type:
Enzyme
Mol. Mass.:
42836.02
Organism:
Homo sapiens (Human)
Description:
P21453
Residue:
382
  
Inhibitor
Name:
BDBM36864
Synonyms:
MLS000074637 N-propyl-N-(5-pyridin-4-yl-1,3,4-thiadiazol-2-yl)thiophene-2-carboxamide SMR000005344 cid_652991
Type:
Small organic molecule
Emp. Form.:
C15H14N4OS2
Mol. Mass.:
330.428
SMILES:
CCCN(C(=O)c1cccs1)c1nnc(s1)-c1ccncc1
: