Target
Sphingosine 1-phosphate receptor 1
Ligand
BDBM37136
Substrate
Meas. Tech.
Dose Response Assays for S1P1 Agonists and Agonism Potentiators - Potentiator Assay 60K MLSMR
EC50
981±n/a nM
Citation
 PubChem, PC Dose Response Assays for S1P1 Agonists and Agonism Potentiators - Potentiator Assay 60K MLSMR PubChem Bioassay (2007)[AID] 
Target
Name:
Sphingosine 1-phosphate receptor 1
Synonyms:
CHEDG1 Endothelial differentiation G-protein coupled receptor 1 S1P1 S1PR1_HUMAN Sphingosine 1-phosphate receptor Edg-1
Type:
Enzyme
Mol. Mass.:
42836.02
Organism:
Homo sapiens (Human)
Description:
P21453
Residue:
382
  
Inhibitor
Name:
BDBM37136
Synonyms:
(3-chloro-4-morpholino-phenyl)amine 3-chloro-4-(4-morpholinyl)aniline MLS000099127 cid_108661
Type:
Small organic molecule
Emp. Form.:
C10H13ClN2O
Mol. Mass.:
212.676
SMILES:
Nc1ccc(N2CCOCC2)c(Cl)c1
: