Target
Sphingosine 1-phosphate receptor 1
Ligand
BDBM31076
Substrate
Meas. Tech.
Dose Response Assays for S1P1 Agonists and Agonism Potentiators - Potentiator Assay 60K MLSMR
EC50
9828±n/a nM
Citation
 PubChem, PC Dose Response Assays for S1P1 Agonists and Agonism Potentiators - Potentiator Assay 60K MLSMR PubChem Bioassay (2007)[AID] 
Target
Name:
Sphingosine 1-phosphate receptor 1
Synonyms:
CHEDG1 Endothelial differentiation G-protein coupled receptor 1 S1P1 S1PR1_HUMAN Sphingosine 1-phosphate receptor Edg-1
Type:
Enzyme
Mol. Mass.:
42836.02
Organism:
Homo sapiens (Human)
Description:
P21453
Residue:
382
  
Inhibitor
Name:
BDBM31076
Synonyms:
2-[1-(4-methoxyphenyl)tetrazol-5-yl]sulfonyl-1-piperidin-1-ylethanone 2-[[1-(4-methoxyphenyl)-1,2,3,4-tetrazol-5-yl]sulfonyl]-1-piperidin-1-yl-ethanone MLS000119145 cid_1263400
Type:
Small organic molecule
Emp. Form.:
C15H19N5O4S
Mol. Mass.:
365.407
SMILES:
COc1ccc(cc1)-n1nnnc1S(=O)(=O)CC(=O)N1CCCCC1
: