Target
Pantothenate synthetase
Ligand
BDBM37305
Substrate
Meas. Tech.
Mycobacterium tuberculosis Pantothenate Synthetase Assay
IC50
>100000±n/a nM
Comments
Extracted from aid = 375 and tid = 12
Citation
 PubChem, PC Mycobacterium tuberculosis Pantothenate Synthetase Assay PubChem Bioassay (2006)[AID] 
Target
Name:
Pantothenate synthetase
Synonyms:
Chain A, Crystal Structure Of A Pantothenate Synthetase, Apo Enzyme In C2 Space Group Pantothenate synthetase | panC
Type:
Mol. Mass.:
32675.10
Organism:
Mycobacterium tuberculosis (strain ATCC 25618 / H37Rv)
Description:
ChEMBL_102878
Residue:
309
  
Inhibitor
Name:
BDBM37305
Synonyms:
MLS000087114 N-[1-(4-chlorobenzyl)-5-methyl-pyrazol-3-yl]-5-(2-methoxyphenyl)isoxazole-3-carboxamide N-[1-[(4-chlorophenyl)methyl]-5-methyl-pyrazol-3-yl]-5-(2-methoxyphenyl)-1,2-oxazole-3-carboxamide SMR000023337 | cid_3244603
Type:
Small organic molecule
Emp. Form.:
C22H19ClN4O3
Mol. Mass.:
422.864
SMILES:
COc1ccccc1-c1cc(no1)C(=O)Nc1cc(C)n(Cc2ccc(Cl)cc2)n1
: