Target
Pantothenate synthetase
Ligand
BDBM37286
Substrate
Meas. Tech.
Mycobacterium tuberculosis Pantothenate Synthetase Assay
IC50
>100000±n/a nM
Comments
Extracted from aid = 375 and tid = 17
Citation
 PubChem, PC Mycobacterium tuberculosis Pantothenate Synthetase Assay PubChem Bioassay (2006)[AID] 
Target
Name:
Pantothenate synthetase
Synonyms:
Chain A, Crystal Structure Of A Pantothenate Synthetase, Apo Enzyme In C2 Space Group Pantothenate synthetase | panC
Type:
Mol. Mass.:
32675.10
Organism:
Mycobacterium tuberculosis (strain ATCC 25618 / H37Rv)
Description:
ChEMBL_102878
Residue:
309
  
Inhibitor
Name:
BDBM37286
Synonyms:
5-tert-butyl-N-[1-(4-fluorobenzyl)-1H-pyrazol-4-yl]-4,5,6,7-tetrahydro-1,2-benzisoxazole-3-carboxamide 5-tert-butyl-N-[1-[(4-fluorophenyl)methyl]-4-pyrazolyl]-4,5,6,7-tetrahydro-1,2-benzoxazole-3-carboxamide MLS000087419 cid_3241472
Type:
Small organic molecule
Emp. Form.:
C22H25FN4O2
Mol. Mass.:
396.4579
SMILES:
CC(C)(C)C1CCc2onc(C(=O)Nc3cnn(Cc4ccc(F)cc4)c3)c2C1
: