Target
Pantothenate synthetase
Ligand
BDBM37295
Substrate
Meas. Tech.
Mycobacterium tuberculosis Pantothenate Synthetase Assay
IC50
>100000±n/a nM
Comments
Extracted from aid = 375 and tid = 22
Citation
 PubChem, PC Mycobacterium tuberculosis Pantothenate Synthetase Assay PubChem Bioassay (2006)[AID] 
Target
Name:
Pantothenate synthetase
Synonyms:
Chain A, Crystal Structure Of A Pantothenate Synthetase, Apo Enzyme In C2 Space Group Pantothenate synthetase | panC
Type:
Mol. Mass.:
32675.10
Organism:
Mycobacterium tuberculosis (strain ATCC 25618 / H37Rv)
Description:
ChEMBL_102878
Residue:
309
  
Inhibitor
Name:
BDBM37295
Synonyms:
MLS000087189 N-[1-(4-chlorobenzyl)-5-methyl-pyrazol-3-yl]-5-(2,5-dimethoxyphenyl)isoxazole-3-carboxamide N-[1-[(4-chlorophenyl)methyl]-5-methyl-pyrazol-3-yl]-5-(2,5-dimethoxyphenyl)-1,2-oxazole-3-carboxamide SMR000023412 | cid_3240323
Type:
Small organic molecule
Emp. Form.:
C23H21ClN4O4
Mol. Mass.:
452.89
SMILES:
COc1ccc(OC)c(c1)-c1cc(no1)C(=O)Nc1cc(C)n(Cc2ccc(Cl)cc2)n1
: