Target
Pantothenate synthetase
Ligand
BDBM37289
Substrate
Meas. Tech.
Mycobacterium tuberculosis Pantothenate Synthetase Assay
IC50
>100000±n/a nM
Comments
Extracted from aid = 375 and tid = 27
Citation
 PubChem, PC Mycobacterium tuberculosis Pantothenate Synthetase Assay PubChem Bioassay (2006)[AID] 
Target
Name:
Pantothenate synthetase
Synonyms:
Chain A, Crystal Structure Of A Pantothenate Synthetase, Apo Enzyme In C2 Space Group Pantothenate synthetase | panC
Type:
Mol. Mass.:
32675.10
Organism:
Mycobacterium tuberculosis (strain ATCC 25618 / H37Rv)
Description:
ChEMBL_102878
Residue:
309
  
Inhibitor
Name:
BDBM37289
Synonyms:
MLS000087278 N-[1-(4-chlorobenzyl)-5-methyl-pyrazol-3-yl]-5-(2-thienyl)isoxazole-3-carboxamide N-[1-[(4-chlorophenyl)methyl]-5-methyl-pyrazol-3-yl]-5-thiophen-2-yl-1,2-oxazole-3-carboxamide SMR000023501 | cid_3236539
Type:
Small organic molecule
Emp. Form.:
C19H15ClN4O2S
Mol. Mass.:
398.866
SMILES:
Cc1cc(NC(=O)c2cc(on2)-c2cccs2)nn1Cc1ccc(Cl)cc1
: