Target
Pantothenate synthetase
Ligand
BDBM37301
Substrate
Meas. Tech.
Mycobacterium tuberculosis Pantothenate Synthetase Assay
IC50
>100000±n/a nM
Comments
k3888r67862
Citation
 PubChem, PC Mycobacterium tuberculosis Pantothenate Synthetase Assay PubChem Bioassay (2006)[AID] 
Target
Name:
Pantothenate synthetase
Synonyms:
Chain A, Crystal Structure Of A Pantothenate Synthetase, Apo Enzyme In C2 Space Group Pantothenate synthetase | panC
Type:
Mol. Mass.:
32675.10
Organism:
Mycobacterium tuberculosis (strain ATCC 25618 / H37Rv)
Description:
ChEMBL_102878
Residue:
309
  
Inhibitor
Name:
BDBM37301
Synonyms:
MLS000087404 N-[1-(4-methylbenzyl)pyrazol-3-yl]-5,6,7,8-tetrahydro-4H-cyclohept[d]isoxazole-3-carboxamide N-[1-[(4-methylphenyl)methyl]pyrazol-3-yl]-5,6,7,8-tetrahydro-4H-cyclohepta[d][1,2]oxazole-3-carboxamide cid_3242754
Type:
Small organic molecule
Emp. Form.:
C20H22N4O2
Mol. Mass.:
350.4143
SMILES:
Cc1ccc(Cn2ccc(NC(=O)c3noc4CCCCCc34)n2)cc1
: