Target
Gag-Pol polyprotein [600-1027,R876K]/[600-1155]
Ligand
BDBM1658
Substrate
poly(rC):oligo(dG)
Meas. Tech.
HIV-1 RT Assay
IC50
850±n/a nM
Citation
 Hargrave, KDProudfoot, JRGrozinger, KGCullen, EKapadia, SRPatel, URFuchs, VUMauldin, SCVitous, JBehnke, ML Novel non-nucleoside inhibitors of HIV-1 reverse transcriptase. 1. Tricyclic pyridobenzo- and dipyridodiazepinones. J Med Chem 34:2231-41 (1991)  
Target
Name:
Gag-Pol polyprotein [600-1027,R876K]/[600-1155]
Synonyms:
EC: 2.7.7.49 | HIV-1 Reverse Transcriptase
Type:
Protein Complex
Mol. Mass.:
113858
Description:
Components:
This complex has 2 components.
Component 1
Name:
Gag-Pol polyprotein [600-1155]
Synonyms:
HIV-1 Reverse Transcriptase Chain A gag-pol
Type:
Enzyme Subunit
Mol. Mass.:
63928.81
Organism:
Human immunodeficiency virus type 1
Description:
P03366[600-1155]
Residue:
556
  
Component 2
Name:
Gag-Pol polyprotein [600-1027,R876K]
Synonyms:
HIV-1 Reverse Transcriptase Chain B gag-pol
Type:
Enzyme Subunit
Mol. Mass.:
49968.63
Organism:
Human immunodeficiency virus type 1
Description:
P03366[600-1027,R876K]
Residue:
428
  
Inhibitor
Name:
BDBM1658
Synonyms:
11-Allyl-5,ll-dihydro-5-methyl-6H-dipyrido[3,2- b:2 ,3 -e][l,4]diazepin-6-one Dipyridodiazepinone deriv. 78
Type:
Small organic molecule
Emp. Form.:
C15H14N4O
Mol. Mass.:
266.2979
SMILES:
CN1c2cccnc2N(CC=C)c2ncccc2C1=O
:
Substrate
Name:
poly(rC):oligo(dG)
Synonyms:
Type:
RNA-DNA duplex
Mol. Mass.:
358.43
Organism:
Description:
The incorporation of Tritium-labeled [3H]dGTP onto a (poly)rC:(oligo)dG template:primer.
Residue:
3
NA