Target
Sphingosine 1-phosphate receptor 3
Ligand
BDBM37312
Substrate
Meas. Tech.
S1P3 Agonist Dose-Response Potency Assay
EC50
>45000±n/a nM
Citation
 PubChem, PC S1P3 Agonist Dose-Response Potency Assay PubChem Bioassay (2007)[AID] 
Target
Name:
Sphingosine 1-phosphate receptor 3
Synonyms:
C9orf108 EDG3 S1P receptor 3 S1P3 S1PR3_HUMAN Sphingosine 1-phosphate receptor 3 (S1P3) | Sphingosine 1-phosphate receptor Edg-3
Type:
G Protein-Coupled Receptor (GPCR)
Mol. Mass.:
42278.13
Organism:
Homo sapiens (Human)
Description:
Q99500
Residue:
378
  
Inhibitor
Name:
BDBM37312
Synonyms:
2-amino-N-(2-furanylmethyl)-1-[2-(1-piperidinyl)ethyl]-3-pyrrolo[3,2-b]quinoxalinecarboxamide 2-amino-N-(furan-2-ylmethyl)-1-(2-piperidin-1-ylethyl)pyrrolo[3,2-b]quinoxaline-3-carboxamide MLS000037322 cid_659069
Type:
Small organic molecule
Emp. Form.:
C23H26N6O2
Mol. Mass.:
418.4915
SMILES:
Nc1c(C(=O)NCc2ccco2)c2nc3ccccc3nc2n1CCN1CCCCC1
: