Target
Sphingosine 1-phosphate receptor 3
Ligand
BDBM37317
Substrate
Meas. Tech.
S1P3 Agonist Dose-Response Potency Assay
EC50
108000±n/a nM
Citation
 PubChem, PC S1P3 Agonist Dose-Response Potency Assay PubChem Bioassay (2007)[AID] 
Target
Name:
Sphingosine 1-phosphate receptor 3
Synonyms:
C9orf108 EDG3 S1P receptor 3 S1P3 S1PR3_HUMAN Sphingosine 1-phosphate receptor 3 (S1P3) | Sphingosine 1-phosphate receptor Edg-3
Type:
G Protein-Coupled Receptor (GPCR)
Mol. Mass.:
42278.13
Organism:
Homo sapiens (Human)
Description:
Q99500
Residue:
378
  
Inhibitor
Name:
BDBM37317
Synonyms:
2-[4-(6-chloranyl-4-phenyl-quinazolin-2-yl)piperazin-1-yl]ethanol 2-[4-(6-chloro-4-phenyl-quinazolin-2-yl)piperazino]ethanol MLS000041663 cid_665288
Type:
Small organic molecule
Emp. Form.:
C20H21ClN4O
Mol. Mass.:
368.86
SMILES:
OCCN1CCN(CC1)c1nc(-c2ccccc2)c2cc(Cl)ccc2n1
: