Target
Sphingosine 1-phosphate receptor 3
Ligand
BDBM37325
Substrate
Meas. Tech.
S1P3 Agonist Dose-Response Potency Assay
EC50
29500±n/a nM
Citation
 PubChem, PC S1P3 Agonist Dose-Response Potency Assay PubChem Bioassay (2007)[AID] 
Target
Name:
Sphingosine 1-phosphate receptor 3
Synonyms:
C9orf108 EDG3 S1P receptor 3 S1P3 S1PR3_HUMAN Sphingosine 1-phosphate receptor 3 (S1P3) | Sphingosine 1-phosphate receptor Edg-3
Type:
G Protein-Coupled Receptor (GPCR)
Mol. Mass.:
42278.13
Organism:
Homo sapiens (Human)
Description:
Q99500
Residue:
378
  
Inhibitor
Name:
BDBM37325
Synonyms:
3-[[5-(2,3-dihydro-1,4-benzodioxin-3-yl)-4-phenyl-1,2,4-triazol-3-yl]sulfanylmethyl]-1,2,3-benzotriazin-4-one MLS000098948 cid_2998674
Type:
Small organic molecule
Emp. Form.:
C24H18N6O3S
Mol. Mass.:
470.503
SMILES:
O=c1n(CSc2nnc(C3COc4ccccc4O3)n2-c2ccccc2)nnc2ccccc12
: