Target
Sphingosine 1-phosphate receptor 3
Ligand
BDBM37326
Substrate
Meas. Tech.
S1P3 Agonist Dose-Response Potency Assay
EC50
>45000±n/a nM
Citation
 PubChem, PC S1P3 Agonist Dose-Response Potency Assay PubChem Bioassay (2007)[AID] 
Target
Name:
Sphingosine 1-phosphate receptor 3
Synonyms:
C9orf108 EDG3 S1P receptor 3 S1P3 S1PR3_HUMAN Sphingosine 1-phosphate receptor 3 (S1P3) | Sphingosine 1-phosphate receptor Edg-3
Type:
G Protein-Coupled Receptor (GPCR)
Mol. Mass.:
42278.13
Organism:
Homo sapiens (Human)
Description:
Q99500
Residue:
378
  
Inhibitor
Name:
BDBM37326
Synonyms:
2-(1,3-dioxoisoindol-2-yl)ethyl 3-(difluoromethoxy)benzoate 3-(difluoromethoxy)benzoic acid 2-(1,3-dioxo-2-isoindolyl)ethyl ester MLS000096503 cid_2390316
Type:
Small organic molecule
Emp. Form.:
C18H13F2NO5
Mol. Mass.:
361.2963
SMILES:
FC(F)Oc1cccc(c1)C(=O)OCCN1C(=O)c2ccccc2C1=O
: