Target
Sphingosine 1-phosphate receptor 3
Ligand
BDBM37340
Substrate
Meas. Tech.
S1P3 Agonist Dose-Response Potency Assay
EC50
2700±n/a nM
Citation
 PubChem, PC S1P3 Agonist Dose-Response Potency Assay PubChem Bioassay (2007)[AID] 
Target
Name:
Sphingosine 1-phosphate receptor 3
Synonyms:
C9orf108 EDG3 S1P receptor 3 S1P3 S1PR3_HUMAN Sphingosine 1-phosphate receptor 3 (S1P3) | Sphingosine 1-phosphate receptor Edg-3
Type:
G Protein-Coupled Receptor (GPCR)
Mol. Mass.:
42278.13
Organism:
Homo sapiens (Human)
Description:
Q99500
Residue:
378
  
Inhibitor
Name:
BDBM37340
Synonyms:
MLS000116372 N,N-dicyclohexyl-5-propyl-3-isoxazolecarboxamide SMR000093349 | cid_5309153
Type:
Small organic molecule
Emp. Form.:
C19H30N2O2
Mol. Mass.:
318.4537
SMILES:
CCCc1cc(no1)C(=O)N(C1CCCCC1)C1CCCCC1
: