Target
Sphingosine 1-phosphate receptor 3
Ligand
BDBM37345
Substrate
Meas. Tech.
S1P3 Agonist Dose-Response Potency Assay
EC50
18500±n/a nM
Citation
 PubChem, PC S1P3 Agonist Dose-Response Potency Assay PubChem Bioassay (2007)[AID] 
Target
Name:
Sphingosine 1-phosphate receptor 3
Synonyms:
C9orf108 EDG3 S1P receptor 3 S1P3 S1PR3_HUMAN Sphingosine 1-phosphate receptor 3 (S1P3) | Sphingosine 1-phosphate receptor Edg-3
Type:
G Protein-Coupled Receptor (GPCR)
Mol. Mass.:
42278.13
Organism:
Homo sapiens (Human)
Description:
Q99500
Residue:
378
  
Inhibitor
Name:
BDBM37345
Synonyms:
2-amino-4-(2-ethoxyphenyl)-5-oxo-4,6,7,8-tetrahydro-1-benzopyran-3-carboxylic acid ethyl ester MLS000111953 cid_2892580 ethyl 2-azanyl-4-(2-ethoxyphenyl)-5-oxidanylidene-4,6,7,8-tetrahydrochromene-3-carboxylate
Type:
Small organic molecule
Emp. Form.:
C20H23NO5
Mol. Mass.:
357.4003
SMILES:
CCOC(=O)C1C(C2=C(CCCC2=O)OC1=N)c1ccccc1OCC
: