Target
M-phase inducer phosphatase 2
Ligand
BDBM35364
Substrate
Meas. Tech.
Cdc25B Catalytic Domain Protein Tyrosine Phosphatase Dose Response Confirmation and Secondary Selectivity/Specificity Assay
IC50
31490±n/a nM
Citation
 PubChem, PC Cdc25B Catalytic Domain Protein Tyrosine Phosphatase Dose Response Confirmation and Secondary Selectivity/Specificity Assay PubChem Bioassay (2006)[AID] 
Target
Name:
M-phase inducer phosphatase 2
Synonyms:
CDC25B Dual specificity phosphatase (CDC25B) M-phase inducer phosphatase 2 (CDC25B) | MPIP2_HUMAN
Type:
Protein
Mol. Mass.:
64985.27
Organism:
Homo sapiens (Human)
Description:
Residue:
580
  
Inhibitor
Name:
BDBM35364
Synonyms:
MLS000079944 cid_659878
Type:
Small organic molecule
Emp. Form.:
C26H21N5O3
Mol. Mass.:
451.4766
SMILES:
COc1ccc(Cn2c(C)nc3n(Cc4ccco4)c4nc5ccccc5nc4c3c2=O)cc1
: