Target
Dual specificity protein phosphatase 6
Ligand
BDBM31756
Substrate
Meas. Tech.
In vitro MKP-3 Phosphatase Dose Response Confirmation and Secondary Selectivity/Selectivity Assay
IC50
>50000±n/a nM
Citation
 PubChem, PC In vitro MKP-3 Phosphatase Dose Response Confirmation and Secondary Selectivity/Selectivity Assay PubChem Bioassay (2006)[AID] 
Target
Name:
Dual specificity protein phosphatase 6
Synonyms:
DUS6_RAT MAP kinase phosphatase 3 Mitogen-activated protein kinase phosphatase 3 | Mkp3
Type:
Enzyme
Mol. Mass.:
42303.19
Organism:
Rattus norvegicus
Description:
gi_16758752
Residue:
381
  
Inhibitor
Name:
BDBM31756
Synonyms:
6,7-dimethyl-3a,4,5,9b-tetrahydro-3H-cyclopenta[c]quinoline-4-carboxylic acid cid_646406
Type:
Small organic molecule
Emp. Form.:
C15H17NO2
Mol. Mass.:
243.301
SMILES:
Cc1ccc2C3C=CCC3C(Nc2c1C)C(O)=O
: