Target
Sphingosine 1-phosphate receptor 1
Ligand
BDBM37094
Substrate
Meas. Tech.
Dose Response Assays for S1P1 Agonists and Agonism Potentiators - Parental Cell Line Counter Screen 60K MLSMR
EC50
>95100±n/a nM
Citation
 PubChem, PC Dose Response Assays for S1P1 Agonists and Agonism Potentiators - Parental Cell Line Counter Screen 60K MLSMR PubChem Bioassay (2007)[AID] 
Target
Name:
Sphingosine 1-phosphate receptor 1
Synonyms:
CHEDG1 Endothelial differentiation G-protein coupled receptor 1 S1P1 S1PR1_HUMAN Sphingosine 1-phosphate receptor Edg-1
Type:
Enzyme
Mol. Mass.:
42836.02
Organism:
Homo sapiens (Human)
Description:
P21453
Residue:
382
  
Inhibitor
Name:
BDBM37094
Synonyms:
MLS000047254 N-[4-[5-(3-methoxyphenyl)-1,2,4-oxadiazol-3-yl]phenyl]nicotinamide N-{4-[5-(3-methoxyphenyl)-1,2,4-oxadiazol-3-yl]phenyl}nicotinamide cid_3244925
Type:
Small organic molecule
Emp. Form.:
C21H16N4O3
Mol. Mass.:
372.3767
SMILES:
COc1cccc(c1)-c1nc(no1)-c1ccc(NC(=O)c2cccnc2)cc1
: