Target
Sphingosine 1-phosphate receptor 1
Ligand
BDBM37204
Substrate
Meas. Tech.
Dose Response Assays for S1P1 Agonists and Agonism Potentiators - Agonist Assay 60K MLSMR
EC50
20280±n/a nM
Citation
 PubChem, PC Dose Response Assays for S1P1 Agonists and Agonism Potentiators - Agonist Assay 60K MLSMR PubChem Bioassay (2007)[AID] 
Target
Name:
Sphingosine 1-phosphate receptor 1
Synonyms:
CHEDG1 Endothelial differentiation G-protein coupled receptor 1 S1P1 S1PR1_HUMAN Sphingosine 1-phosphate receptor Edg-1
Type:
Enzyme
Mol. Mass.:
42836.02
Organism:
Homo sapiens (Human)
Description:
P21453
Residue:
382
  
Inhibitor
Name:
BDBM37204
Synonyms:
8-[[4-(3-chlorophenyl)-1-piperazinyl]methyl]-1,3-dimethyl-7-propylpurine-2,6-dione 8-[[4-(3-chlorophenyl)piperazin-1-yl]methyl]-1,3-dimethyl-7-propylpurine-2,6-dione MLS000104035 cid_4891472
Type:
Small organic molecule
Emp. Form.:
C21H27ClN6O2
Mol. Mass.:
430.931
SMILES:
CCCn1c(CN2CCN(CC2)c2cccc(Cl)c2)nc2n(C)c(=O)n(C)c(=O)c12
: