Target
Sphingosine 1-phosphate receptor 3
Ligand
BDBM37355
Substrate
Meas. Tech.
Dose Response Assay for S1P3 Antagonists
IC50
>49800±n/a nM
Citation
 PubChem, PC Dose Response Assay for S1P3 Antagonists PubChem Bioassay (2007)[AID] 
Target
Name:
Sphingosine 1-phosphate receptor 3
Synonyms:
C9orf108 EDG3 S1P receptor 3 S1P3 S1PR3_HUMAN Sphingosine 1-phosphate receptor 3 (S1P3) | Sphingosine 1-phosphate receptor Edg-3
Type:
G Protein-Coupled Receptor (GPCR)
Mol. Mass.:
42278.13
Organism:
Homo sapiens (Human)
Description:
Q99500
Residue:
378
  
Inhibitor
Name:
BDBM37355
Synonyms:
4-[(3,3-dimethyl-5-oxidanylidene-cyclohexylidene)amino]benzoic acid 4-[(5-keto-3,3-dimethyl-cyclohexylidene)amino]benzoic acid MLS000077323 cid_647660
Type:
Small organic molecule
Emp. Form.:
C15H17NO3
Mol. Mass.:
259.3004
SMILES:
CC1(C)CC(=O)C=C(C1)Nc1ccc(cc1)C(O)=O
: