Target
Sphingosine 1-phosphate receptor 3
Ligand
BDBM37385
Substrate
Meas. Tech.
Dose Response Assay for S1P3 Antagonists
IC50
>49800±n/a nM
Citation
 PubChem, PC Dose Response Assay for S1P3 Antagonists PubChem Bioassay (2007)[AID] 
Target
Name:
Sphingosine 1-phosphate receptor 3
Synonyms:
C9orf108 EDG3 S1P receptor 3 S1P3 S1PR3_HUMAN Sphingosine 1-phosphate receptor 3 (S1P3) | Sphingosine 1-phosphate receptor Edg-3
Type:
G Protein-Coupled Receptor (GPCR)
Mol. Mass.:
42278.13
Organism:
Homo sapiens (Human)
Description:
Q99500
Residue:
378
  
Inhibitor
Name:
BDBM37385
Synonyms:
6-amino-1-benzyl-3-ethyl-5-(2-morpholin-4-ylacetyl)pyrimidine-2,4-dione 6-amino-3-ethyl-5-[2-(4-morpholinyl)-1-oxoethyl]-1-(phenylmethyl)pyrimidine-2,4-dione MLS000053461 cid_2119654
Type:
Small organic molecule
Emp. Form.:
C19H24N4O4
Mol. Mass.:
372.4183
SMILES:
CCn1c(=O)c(C(=O)CN2CCOCC2)c(N)n(Cc2ccccc2)c1=O
: