Target
Sphingosine 1-phosphate receptor 3
Ligand
BDBM37389
Substrate
Meas. Tech.
Dose Response Assay for S1P3 Antagonists
IC50
>49800±n/a nM
Citation
 PubChem, PC Dose Response Assay for S1P3 Antagonists PubChem Bioassay (2007)[AID] 
Target
Name:
Sphingosine 1-phosphate receptor 3
Synonyms:
C9orf108 EDG3 S1P receptor 3 S1P3 S1PR3_HUMAN Sphingosine 1-phosphate receptor 3 (S1P3) | Sphingosine 1-phosphate receptor Edg-3
Type:
G Protein-Coupled Receptor (GPCR)
Mol. Mass.:
42278.13
Organism:
Homo sapiens (Human)
Description:
Q99500
Residue:
378
  
Inhibitor
Name:
BDBM37389
Synonyms:
1-(2,8-dimethyl-3,4,4a,9b-tetrahydro-1H-pyrid[4,3-b]indol-5-yl)-2-(4-morpholinosulfonylphenoxy)ethanone 1-(2,8-dimethyl-3,4,4a,9b-tetrahydro-1H-pyrido[4,3-b]indol-5-yl)-2-[4-(4-morpholinylsulfonyl)phenoxy]ethanone SMR000060851 | cid_2998310
Type:
Small organic molecule
Emp. Form.:
C25H31N3O5S
Mol. Mass.:
485.596
SMILES:
CN1CCC2C(C1)c1cc(C)ccc1N2C(=O)COc1ccc(cc1)S(=O)(=O)N1CCOCC1
: