Target
Sphingosine 1-phosphate receptor 3
Ligand
BDBM37391
Substrate
Meas. Tech.
Dose Response Assay for S1P3 Antagonists
IC50
>49800±n/a nM
Citation
 PubChem, PC Dose Response Assay for S1P3 Antagonists PubChem Bioassay (2007)[AID] 
Target
Name:
Sphingosine 1-phosphate receptor 3
Synonyms:
C9orf108 EDG3 S1P receptor 3 S1P3 S1PR3_HUMAN Sphingosine 1-phosphate receptor 3 (S1P3) | Sphingosine 1-phosphate receptor Edg-3
Type:
G Protein-Coupled Receptor (GPCR)
Mol. Mass.:
42278.13
Organism:
Homo sapiens (Human)
Description:
Q99500
Residue:
378
  
Inhibitor
Name:
BDBM37391
Synonyms:
(Z)-1-(4-bromophenyl)-2-[[5-(phenylmethyl)-1,3,4-oxadiazol-2-yl]sulfanyl]ethenol;hydrobromide (Z)-2-[(5-benzyl-1,3,4-oxadiazol-2-yl)sulfanyl]-1-(4-bromophenyl)ethenol;hydrobromide MLS000055167 cid_6602902
Type:
Small organic molecule
Emp. Form.:
C17H13BrN2O2S
Mol. Mass.:
389.266
SMILES:
Brc1ccc(cc1)C(=O)CSc1nnc(Cc2ccccc2)o1
: