Target
Sphingosine 1-phosphate receptor 3
Ligand
BDBM37405
Substrate
Meas. Tech.
Dose Response Assay for S1P3 Antagonists
IC50
>49800±n/a nM
Citation
 PubChem, PC Dose Response Assay for S1P3 Antagonists PubChem Bioassay (2007)[AID] 
Target
Name:
Sphingosine 1-phosphate receptor 3
Synonyms:
C9orf108 EDG3 S1P receptor 3 S1P3 S1PR3_HUMAN Sphingosine 1-phosphate receptor 3 (S1P3) | Sphingosine 1-phosphate receptor Edg-3
Type:
G Protein-Coupled Receptor (GPCR)
Mol. Mass.:
42278.13
Organism:
Homo sapiens (Human)
Description:
Q99500
Residue:
378
  
Inhibitor
Name:
BDBM37405
Synonyms:
2-[[5-(2-bromophenyl)-4-keto-1H-pyrazolo[3,4-d]pyrimidin-6-yl]thio]-N-(2-furfuryl)acetamide 2-[[5-(2-bromophenyl)-4-oxo-1H-pyrazolo[3,4-d]pyrimidin-6-yl]sulfanyl]-N-(furan-2-ylmethyl)acetamide 2-{[5-(2-bromophenyl)-4-oxo-4,5-dihydro-1H-pyrazolo[3,4-d]pyrimidin-6-yl]thio}-N-(2-furylmethyl)acetamide SMR000031392 | cid_3238890
Type:
Small organic molecule
Emp. Form.:
C18H14BrN5O3S
Mol. Mass.:
460.304
SMILES:
Brc1ccccc1-n1c(SCC(=O)NCc2ccco2)nc2n[nH]cc2c1=O
: