Target
Sphingosine 1-phosphate receptor 3
Ligand
BDBM37430
Substrate
Meas. Tech.
Dose Response Assay for S1P3 Antagonists
IC50
>49800±n/a nM
Citation
 PubChem, PC Dose Response Assay for S1P3 Antagonists PubChem Bioassay (2007)[AID] 
Target
Name:
Sphingosine 1-phosphate receptor 3
Synonyms:
C9orf108 EDG3 S1P receptor 3 S1P3 S1PR3_HUMAN Sphingosine 1-phosphate receptor 3 (S1P3) | Sphingosine 1-phosphate receptor Edg-3
Type:
G Protein-Coupled Receptor (GPCR)
Mol. Mass.:
42278.13
Organism:
Homo sapiens (Human)
Description:
Q99500
Residue:
378
  
Inhibitor
Name:
BDBM37430
Synonyms:
4-(2,3-dihydroindol-1-yl)-1-(3-methylphenyl)pyrazolo[3,4-d]pyrimidine MLS000089145 cid_891582
Type:
Small organic molecule
Emp. Form.:
C20H17N5
Mol. Mass.:
327.3825
SMILES:
Cc1cccc(c1)-n1ncc2c(ncnc12)N1CCc2ccccc12
: