Target
Sphingosine 1-phosphate receptor 3
Ligand
BDBM37437
Substrate
Meas. Tech.
Dose Response Assay for S1P3 Antagonists
IC50
>49800±n/a nM
Citation
 PubChem, PC Dose Response Assay for S1P3 Antagonists PubChem Bioassay (2007)[AID] 
Target
Name:
Sphingosine 1-phosphate receptor 3
Synonyms:
C9orf108 EDG3 S1P receptor 3 S1P3 S1PR3_HUMAN Sphingosine 1-phosphate receptor 3 (S1P3) | Sphingosine 1-phosphate receptor Edg-3
Type:
G Protein-Coupled Receptor (GPCR)
Mol. Mass.:
42278.13
Organism:
Homo sapiens (Human)
Description:
Q99500
Residue:
378
  
Inhibitor
Name:
BDBM37437
Synonyms:
MLS000061720 N-[3-(4-oxidanylidene-3,1-benzoxazin-2-yl)phenyl]ethanamide N-[3-(4-oxo-4H-3,1-benzoxazin-2-yl)phenyl]acetamide cid_693837
Type:
Small organic molecule
Emp. Form.:
C16H12N2O3
Mol. Mass.:
280.2781
SMILES:
CC(=O)Nc1cccc(c1)-c1nc2ccccc2c(=O)o1
: