Target
Sphingosine 1-phosphate receptor 3
Ligand
BDBM37439
Substrate
Meas. Tech.
Dose Response Assay for S1P3 Antagonists
IC50
30990±n/a nM
Citation
 PubChem, PC Dose Response Assay for S1P3 Antagonists PubChem Bioassay (2007)[AID] 
Target
Name:
Sphingosine 1-phosphate receptor 3
Synonyms:
C9orf108 EDG3 S1P receptor 3 S1P3 S1PR3_HUMAN Sphingosine 1-phosphate receptor 3 (S1P3) | Sphingosine 1-phosphate receptor Edg-3
Type:
G Protein-Coupled Receptor (GPCR)
Mol. Mass.:
42278.13
Organism:
Homo sapiens (Human)
Description:
Q99500
Residue:
378
  
Inhibitor
Name:
BDBM37439
Synonyms:
6-amino-8-(4-chlorophenyl)-8H-[1,3]dioxolo[4,5-g][1]benzopyran-7-carbonitrile 6-azanyl-8-(4-chlorophenyl)-8H-[1,3]dioxolo[4,5-g]chromene-7-carbonitrile SMR000073668 | cid_2943028
Type:
Small organic molecule
Emp. Form.:
C17H11ClN2O3
Mol. Mass.:
326.734
SMILES:
Clc1ccc(cc1)C1C(C#N)C(=N)Oc2cc3OCOc3cc12
: