Target
Sphingosine 1-phosphate receptor 3
Ligand
BDBM37163
Substrate
Meas. Tech.
Dose Response Assay for S1P3 Antagonists
IC50
4261±n/a nM
Citation
 PubChem, PC Dose Response Assay for S1P3 Antagonists PubChem Bioassay (2007)[AID] 
Target
Name:
Sphingosine 1-phosphate receptor 3
Synonyms:
C9orf108 EDG3 S1P receptor 3 S1P3 S1PR3_HUMAN Sphingosine 1-phosphate receptor 3 (S1P3) | Sphingosine 1-phosphate receptor Edg-3
Type:
G Protein-Coupled Receptor (GPCR)
Mol. Mass.:
42278.13
Organism:
Homo sapiens (Human)
Description:
Q99500
Residue:
378
  
Inhibitor
Name:
BDBM37163
Synonyms:
MLS000119027 N-(5-bromo-1,3-thiazol-2-yl)-3-phenyl-2-pyrrol-1-ylpropanamide N-(5-bromothiazol-2-yl)-3-phenyl-2-pyrrol-1-yl-propionamide cid_5308071
Type:
Small organic molecule
Emp. Form.:
C16H14BrN3OS
Mol. Mass.:
376.271
SMILES:
Brc1cnc(NC(=O)C(Cc2ccccc2)n2cccc2)s1
: