Target
Sphingosine 1-phosphate receptor 3
Ligand
BDBM37467
Substrate
Meas. Tech.
Dose Response Assay for S1P3 Antagonists
IC50
>49800±n/a nM
Citation
 PubChem, PC Dose Response Assay for S1P3 Antagonists PubChem Bioassay (2007)[AID] 
Target
Name:
Sphingosine 1-phosphate receptor 3
Synonyms:
C9orf108 EDG3 S1P receptor 3 S1P3 S1PR3_HUMAN Sphingosine 1-phosphate receptor 3 (S1P3) | Sphingosine 1-phosphate receptor Edg-3
Type:
G Protein-Coupled Receptor (GPCR)
Mol. Mass.:
42278.13
Organism:
Homo sapiens (Human)
Description:
Q99500
Residue:
378
  
Inhibitor
Name:
BDBM37467
Synonyms:
5-(4-fluorobenzyl)-N-piperonyl-1,3,4-oxadiazole-2-carboxamide N-(1,3-benzodioxol-5-ylmethyl)-5-[(4-fluorophenyl)methyl]-1,3,4-oxadiazole-2-carboxamide cid_5308274
Type:
Small organic molecule
Emp. Form.:
C18H14FN3O4
Mol. Mass.:
355.3199
SMILES:
Fc1ccc(Cc2nnc(o2)C(=O)NCc2ccc3OCOc3c2)cc1
: