Target
Sphingosine 1-phosphate receptor 3
Ligand
BDBM37470
Substrate
Meas. Tech.
Dose Response Assay for S1P3 Antagonists
IC50
>49800±n/a nM
Citation
 PubChem, PC Dose Response Assay for S1P3 Antagonists PubChem Bioassay (2007)[AID] 
Target
Name:
Sphingosine 1-phosphate receptor 3
Synonyms:
C9orf108 EDG3 S1P receptor 3 S1P3 S1PR3_HUMAN Sphingosine 1-phosphate receptor 3 (S1P3) | Sphingosine 1-phosphate receptor Edg-3
Type:
G Protein-Coupled Receptor (GPCR)
Mol. Mass.:
42278.13
Organism:
Homo sapiens (Human)
Description:
Q99500
Residue:
378
  
Inhibitor
Name:
BDBM37470
Synonyms:
MLS000119232 [4-(1,3-benzoxazol-2-yl)-1-piperazinyl]-(4-phenylphenyl)methanone [4-(1,3-benzoxazol-2-yl)piperazino]-(4-phenylphenyl)methanone | cid_1521397
Type:
Small organic molecule
Emp. Form.:
C24H21N3O2
Mol. Mass.:
383.4424
SMILES:
O=C(N1CCN(CC1)c1nc2ccccc2o1)c1ccc(cc1)-c1ccccc1
: