Target
Sphingosine 1-phosphate receptor 3
Ligand
BDBM37478
Substrate
Meas. Tech.
Dose Response Assay for S1P3 Antagonists
IC50
>16600±n/a nM
Citation
 PubChem, PC Dose Response Assay for S1P3 Antagonists PubChem Bioassay (2007)[AID] 
Target
Name:
Sphingosine 1-phosphate receptor 3
Synonyms:
C9orf108 EDG3 S1P receptor 3 S1P3 S1PR3_HUMAN Sphingosine 1-phosphate receptor 3 (S1P3) | Sphingosine 1-phosphate receptor Edg-3
Type:
G Protein-Coupled Receptor (GPCR)
Mol. Mass.:
42278.13
Organism:
Homo sapiens (Human)
Description:
Q99500
Residue:
378
  
Inhibitor
Name:
BDBM37478
Synonyms:
1-(6-ethoxy-1,3-benzothiazol-2-yl)-3-(2-thienyl)urea 1-(6-ethoxy-1,3-benzothiazol-2-yl)-3-thiophen-2-ylurea SMR000096899 | cid_4101591
Type:
Small organic molecule
Emp. Form.:
C14H13N3O2S2
Mol. Mass.:
319.402
SMILES:
CCOc1ccc2nc(NC(=O)Nc3cccs3)sc2c1
: