Target
Sphingosine 1-phosphate receptor 3
Ligand
BDBM37194
Substrate
Meas. Tech.
Dose Response Assay for S1P3 Antagonists
IC50
>49800±n/a nM
Citation
 PubChem, PC Dose Response Assay for S1P3 Antagonists PubChem Bioassay (2007)[AID] 
Target
Name:
Sphingosine 1-phosphate receptor 3
Synonyms:
C9orf108 EDG3 S1P receptor 3 S1P3 S1PR3_HUMAN Sphingosine 1-phosphate receptor 3 (S1P3) | Sphingosine 1-phosphate receptor Edg-3
Type:
G Protein-Coupled Receptor (GPCR)
Mol. Mass.:
42278.13
Organism:
Homo sapiens (Human)
Description:
Q99500
Residue:
378
  
Inhibitor
Name:
BDBM37194
Synonyms:
1-(3,4-dimethoxyphenyl)sulfonyl-4-(2,4-dimethylphenyl)piperazine SMR000092862 | cid_1262214
Type:
Small organic molecule
Emp. Form.:
C20H26N2O4S
Mol. Mass.:
390.496
SMILES:
COc1ccc(cc1OC)S(=O)(=O)N1CCN(CC1)c1ccc(C)cc1C
: