Target
Sphingosine 1-phosphate receptor 3
Ligand
BDBM37490
Substrate
Meas. Tech.
Dose Response Assay for S1P3 Antagonists
IC50
>49800±n/a nM
Citation
 PubChem, PC Dose Response Assay for S1P3 Antagonists PubChem Bioassay (2007)[AID] 
Target
Name:
Sphingosine 1-phosphate receptor 3
Synonyms:
C9orf108 EDG3 S1P receptor 3 S1P3 S1PR3_HUMAN Sphingosine 1-phosphate receptor 3 (S1P3) | Sphingosine 1-phosphate receptor Edg-3
Type:
G Protein-Coupled Receptor (GPCR)
Mol. Mass.:
42278.13
Organism:
Homo sapiens (Human)
Description:
Q99500
Residue:
378
  
Inhibitor
Name:
BDBM37490
Synonyms:
6-(butylthio)-2-keto-4-(o-tolyl)-3,4-dihydro-1H-pyridine-5-carbonitrile 6-butylsulfanyl-4-(2-methylphenyl)-2-oxidanylidene-3,4-dihydro-1H-pyridine-5-carbonitrile MLS000103088 cid_3772589
Type:
Small organic molecule
Emp. Form.:
C17H20N2OS
Mol. Mass.:
300.418
SMILES:
CCCCSC1=C(C#N)C(CC(=O)N1)c1ccccc1C
: