Target
Huntingtin
Ligand
BDBM37521
Substrate
Meas. Tech.
Clearance of Mutant Huntingtin Protein - Confirmatory screen
IC50
>8000±n/a nM
Citation
 PubChem, PC Clearance of Mutant Huntingtin Protein - Confirmatory screen PubChem Bioassay (2007)[AID] 
Target
Name:
Huntingtin
Synonyms:
HD HD_HUMAN Homo sapiens huntingtin (HTT), mRNA Huntington disease protein | IT15
Type:
PROTEIN
Mol. Mass.:
347579.69
Organism:
Homo sapiens (Human)
Description:
EBI_101216
Residue:
3142
  
Inhibitor
Name:
BDBM37521
Synonyms:
2-[5-(4-Fluoro-phenyl)-1-methyl-1H-imidazol-2-ylsulfanyl]-N-(2-morpholin-4-yl-phenyl)-acetamide 2-[5-(4-fluorophenyl)-1-methylimidazol-2-yl]sulfanyl-N-(2-morpholin-4-ylphenyl)acetamide 2-[[5-(4-fluorophenyl)-1-methyl-imidazol-2-yl]thio]-N-(2-morpholinophenyl)acetamide SMR000005285 | cid_647688
Type:
Small organic molecule
Emp. Form.:
C22H23FN4O2S
Mol. Mass.:
426.507
SMILES:
Cn1c(SCC(=O)Nc2ccccc2N2CCOCC2)ncc1-c1ccc(F)cc1
: