Target
Huntingtin
Ligand
BDBM37531
Substrate
Meas. Tech.
Clearance of Mutant Huntingtin Protein - Confirmatory screen
IC50
>8000±n/a nM
Citation
 PubChem, PC Clearance of Mutant Huntingtin Protein - Confirmatory screen PubChem Bioassay (2007)[AID] 
Target
Name:
Huntingtin
Synonyms:
HD HD_HUMAN Homo sapiens huntingtin (HTT), mRNA Huntington disease protein | IT15
Type:
PROTEIN
Mol. Mass.:
347579.69
Organism:
Homo sapiens (Human)
Description:
EBI_101216
Residue:
3142
  
Inhibitor
Name:
BDBM37531
Synonyms:
(4-Methyl-quinazolin-2-yl)-[5-(tetrahydro-furan-2-ylmethyl)-1,4,5,6-tetrahydro-[1,3,5]triazin-2-yl]-amine 4-methyl-N-[3-(2-oxolanylmethyl)-2,4-dihydro-1H-1,3,5-triazin-6-yl]-2-quinazolinamine MLS000075817 cid_654280
Type:
Small organic molecule
Emp. Form.:
C17H22N6O
Mol. Mass.:
326.3962
SMILES:
Cc1nc(NC2=NCN(CC3CCCO3)CN2)nc2ccccc12
: