Target
Huntingtin
Ligand
BDBM37556
Substrate
Meas. Tech.
Clearance of Mutant Huntingtin Protein - Confirmatory screen
IC50
>8000±n/a nM
Citation
 PubChem, PC Clearance of Mutant Huntingtin Protein - Confirmatory screen PubChem Bioassay (2007)[AID] 
Target
Name:
Huntingtin
Synonyms:
HD HD_HUMAN Homo sapiens huntingtin (HTT), mRNA Huntington disease protein | IT15
Type:
PROTEIN
Mol. Mass.:
347579.69
Organism:
Homo sapiens (Human)
Description:
EBI_101216
Residue:
3142
  
Inhibitor
Name:
BDBM37556
Synonyms:
1-[4-(2-furoyl)piperazino]-2-[[5-(2-furyl)-4-phenyl-1,2,4-triazol-3-yl]thio]ethanone 1-[4-(furan-2-ylcarbonyl)piperazin-1-yl]-2-[[5-(furan-2-yl)-4-phenyl-1,2,4-triazol-3-yl]sulfanyl]ethanone MLS000048836 cid_2410419
Type:
Small organic molecule
Emp. Form.:
C23H21N5O4S
Mol. Mass.:
463.509
SMILES:
O=C(CSc1nnc(-c2ccco2)n1-c1ccccc1)N1CCN(CC1)C(=O)c1ccco1
: