Target
Huntingtin
Ligand
BDBM37560
Substrate
Meas. Tech.
Clearance of Mutant Huntingtin Protein - Confirmatory screen
IC50
>8000±n/a nM
Citation
 PubChem, PC Clearance of Mutant Huntingtin Protein - Confirmatory screen PubChem Bioassay (2007)[AID] 
Target
Name:
Huntingtin
Synonyms:
HD HD_HUMAN Homo sapiens huntingtin (HTT), mRNA Huntington disease protein | IT15
Type:
PROTEIN
Mol. Mass.:
347579.69
Organism:
Homo sapiens (Human)
Description:
EBI_101216
Residue:
3142
  
Inhibitor
Name:
BDBM37560
Synonyms:
MLS000045970 N-[2-(3,4-dimethoxyphenyl)ethyl]-4-(2-oxo-1-pyrrolidinyl)benzamide N-homoveratryl-4-(2-ketopyrrolidino)benzamide cid_3236773
Type:
Small organic molecule
Emp. Form.:
C21H24N2O4
Mol. Mass.:
368.4263
SMILES:
COc1ccc(CCNC(=O)c2ccc(cc2)N2CCCC2=O)cc1OC
: