Target
Huntingtin
Ligand
BDBM37567
Substrate
Meas. Tech.
Clearance of Mutant Huntingtin Protein - Confirmatory screen
IC50
>8000±n/a nM
Citation
 PubChem, PC Clearance of Mutant Huntingtin Protein - Confirmatory screen PubChem Bioassay (2007)[AID] 
Target
Name:
Huntingtin
Synonyms:
HD HD_HUMAN Homo sapiens huntingtin (HTT), mRNA Huntington disease protein | IT15
Type:
PROTEIN
Mol. Mass.:
347579.69
Organism:
Homo sapiens (Human)
Description:
EBI_101216
Residue:
3142
  
Inhibitor
Name:
BDBM37567
Synonyms:
3-methyl-5-(1-piperidinylsulfonyl)-N-(3-pyridinylmethyl)-2-benzofurancarboxamide 3-methyl-5-piperidin-1-ylsulfonyl-N-(pyridin-3-ylmethyl)-1-benzofuran-2-carboxamide MLS000046283 cid_3241712
Type:
Small organic molecule
Emp. Form.:
C21H23N3O4S
Mol. Mass.:
413.49
SMILES:
Cc1c(oc2ccc(cc12)S(=O)(=O)N1CCCCC1)C(=O)NCc1cccnc1
: