Target
Huntingtin
Ligand
BDBM37571
Substrate
Meas. Tech.
Clearance of Mutant Huntingtin Protein - Confirmatory screen
IC50
>8000±n/a nM
Citation
 PubChem, PC Clearance of Mutant Huntingtin Protein - Confirmatory screen PubChem Bioassay (2007)[AID] 
Target
Name:
Huntingtin
Synonyms:
HD HD_HUMAN Homo sapiens huntingtin (HTT), mRNA Huntington disease protein | IT15
Type:
PROTEIN
Mol. Mass.:
347579.69
Organism:
Homo sapiens (Human)
Description:
EBI_101216
Residue:
3142
  
Inhibitor
Name:
BDBM37571
Synonyms:
1-[2-[2,5-bis(oxidanylidene)imidazolidin-4-yl]ethanoyl-(furan-2-ylmethyl)amino]-N-cyclopentyl-cyclohexane-1-carboxamide N-cyclopentyl-1-[[(2,5-dioxoimidazolidin-4-yl)acetyl](2-furylmethyl)amino]cyclohexanecarboxamide N-cyclopentyl-1-[[2-(2,5-dioxo-4-imidazolidinyl)-1-oxoethyl]-(2-furanylmethyl)amino]-1-cyclohexanecarboxamide SMR000021964 | cid_3243945
Type:
Small organic molecule
Emp. Form.:
C22H30N4O5
Mol. Mass.:
430.4974
SMILES:
O=C(CC1NC(=O)NC1=O)N(Cc1ccco1)C1(CCCCC1)C(=O)NC1CCCC1
: