Target
Huntingtin
Ligand
BDBM37573
Substrate
Meas. Tech.
Clearance of Mutant Huntingtin Protein - Confirmatory screen
IC50
>8000±n/a nM
Citation
 PubChem, PC Clearance of Mutant Huntingtin Protein - Confirmatory screen PubChem Bioassay (2007)[AID] 
Target
Name:
Huntingtin
Synonyms:
HD HD_HUMAN Homo sapiens huntingtin (HTT), mRNA Huntington disease protein | IT15
Type:
PROTEIN
Mol. Mass.:
347579.69
Organism:
Homo sapiens (Human)
Description:
EBI_101216
Residue:
3142
  
Inhibitor
Name:
BDBM37573
Synonyms:
MLS000044182 N-[1-(cyclopentylcarbamoyl)cyclohexyl]-N-(furan-2-ylmethyl)-6-oxidanylidene-1H-pyridine-3-carboxamide N-[1-[(cyclopentylamino)-oxomethyl]cyclohexyl]-N-(2-furanylmethyl)-6-oxo-1H-pyridine-3-carboxamide SMR000021966 | cid_3245326
Type:
Small organic molecule
Emp. Form.:
C23H29N3O4
Mol. Mass.:
411.4941
SMILES:
O=C(NC1CCCC1)C1(CCCCC1)N(Cc1ccco1)C(=O)c1ccc(=O)[nH]c1
: