Target
Huntingtin
Ligand
BDBM37581
Substrate
Meas. Tech.
Clearance of Mutant Huntingtin Protein - Confirmatory screen
IC50
>8000±n/a nM
Citation
 PubChem, PC Clearance of Mutant Huntingtin Protein - Confirmatory screen PubChem Bioassay (2007)[AID] 
Target
Name:
Huntingtin
Synonyms:
HD HD_HUMAN Homo sapiens huntingtin (HTT), mRNA Huntington disease protein | IT15
Type:
PROTEIN
Mol. Mass.:
347579.69
Organism:
Homo sapiens (Human)
Description:
EBI_101216
Residue:
3142
  
Inhibitor
Name:
BDBM37581
Synonyms:
4-(2-keto-2-pyrrolidino-ethoxy)-N-p-phenetyl-benzenesulfonamide N-(4-ethoxyphenyl)-4-(2-oxidanylidene-2-pyrrolidin-1-yl-ethoxy)benzenesulfonamide N-(4-ethoxyphenyl)-4-[2-oxo-2-(1-pyrrolidinyl)ethoxy]benzenesulfonamide cid_2231483
Type:
Small organic molecule
Emp. Form.:
C20H24N2O5S
Mol. Mass.:
404.48
SMILES:
CCOc1ccc(NS(=O)(=O)c2ccc(OCC(=O)N3CCCC3)cc2)cc1
: