Target
Huntingtin
Ligand
BDBM37584
Substrate
Meas. Tech.
Clearance of Mutant Huntingtin Protein - Confirmatory screen
IC50
>8000±n/a nM
Citation
 PubChem, PC Clearance of Mutant Huntingtin Protein - Confirmatory screen PubChem Bioassay (2007)[AID] 
Target
Name:
Huntingtin
Synonyms:
HD HD_HUMAN Homo sapiens huntingtin (HTT), mRNA Huntington disease protein | IT15
Type:
PROTEIN
Mol. Mass.:
347579.69
Organism:
Homo sapiens (Human)
Description:
EBI_101216
Residue:
3142
  
Inhibitor
Name:
BDBM37584
Synonyms:
MLS000116416 N-[1-[(2,4-dichlorophenyl)methyl]-4-pyrazolyl]-4,5,6,7-tetrahydro-1,2-benzoxazole-3-carboxamide SMR000093393 | cid_5307340
Type:
Small organic molecule
Emp. Form.:
C18H16Cl2N4O2
Mol. Mass.:
391.251
SMILES:
Clc1ccc(Cn2cc(NC(=O)c3noc4CCCCc34)cn2)c(Cl)c1
: