Target
fMet-Leu-Phe receptor
Ligand
BDBM37644
Substrate
Meas. Tech.
Dose Response Assay for Formylpeptide Receptor (FPR) Ligands and Dose Response Counter-Screen Assay for Formylpeptide-Like-1 (FPRL1) Ligands
Ki
17300±n/a nM
Citation
 PubChem, PC Dose Response Assay for Formylpeptide Receptor (FPR) Ligands and Dose Response Counter-Screen Assay for Formylpeptide-Like-1 (FPRL1) Ligands PubChem Bioassay (2007)[AID] 
Target
Name:
fMet-Leu-Phe receptor
Synonyms:
FPR FPR1_HUMAN N-formyl peptide receptor 1 fMLP receptor formyl peptide receptor 1
Type:
Enzyme Catalytic Domain
Mol. Mass.:
38456.14
Organism:
Homo sapiens (Human)
Description:
gi_4503779
Residue:
350
  
Inhibitor
Name:
BDBM37644
Synonyms:
2-(2,5-dimethoxyphenyl)-3-(furan-2-carbonyl)-4-hydroxy-1-(3-morpholin-4-ylpropyl)-2H-pyrrol-5-one 2-(2,5-dimethoxyphenyl)-3-[2-furanyl(oxo)methyl]-4-hydroxy-1-[3-(4-morpholinyl)propyl]-2H-pyrrol-5-one MLS000036486 cid_660781
Type:
Small organic molecule
Emp. Form.:
C24H28N2O7
Mol. Mass.:
456.4883
SMILES:
COc1ccc(OC)c(c1)C1C(C(=O)c2ccco2)C(=O)C(=O)N1CCCN1CCOCC1
: