Target
fMet-Leu-Phe receptor
Ligand
BDBM37658
Substrate
Meas. Tech.
Dose Response Assay for Formylpeptide Receptor (FPR) Ligands and Dose Response Counter-Screen Assay for Formylpeptide-Like-1 (FPRL1) Ligands
Ki
19400±n/a nM
Citation
 PubChem, PC Dose Response Assay for Formylpeptide Receptor (FPR) Ligands and Dose Response Counter-Screen Assay for Formylpeptide-Like-1 (FPRL1) Ligands PubChem Bioassay (2007)[AID] 
Target
Name:
fMet-Leu-Phe receptor
Synonyms:
FPR FPR1_HUMAN N-formyl peptide receptor 1 fMLP receptor formyl peptide receptor 1
Type:
Enzyme Catalytic Domain
Mol. Mass.:
38456.14
Organism:
Homo sapiens (Human)
Description:
gi_4503779
Residue:
350
  
Inhibitor
Name:
BDBM37658
Synonyms:
3-(furan-2-carbonyl)-4-hydroxy-1-[2-(2-hydroxyethoxy)ethyl]-2-[4-hydroxy-3-(methoxymethyl)phenyl]-2H-pyrrol-5-one 3-[2-furanyl(oxo)methyl]-4-hydroxy-1-[2-(2-hydroxyethoxy)ethyl]-2-[4-hydroxy-3-(methoxymethyl)phenyl]-2H-pyrrol-5-one MLS000081316 cid_662399
Type:
Small organic molecule
Emp. Form.:
C21H23NO8
Mol. Mass.:
417.4092
SMILES:
COCc1cc(ccc1O)C1C(C(=O)c2ccco2)C(=O)C(=O)N1CCOCCO
: